Reaction Details
Target3-hydroxy-3-methylglutaryl-coenzyme A reductase
LigandBDBM50231028
Substrate/Competitorn/a
Meas. Tech.ChEMBL_461936 (CHEMBL944783)
IC50 2.6±n/a nM
Citation Park, WKKennedy, RMLarsen, SDMiller, SRoth, BDSong, YSteinbaugh, BASun, KTait, BDKowala, MCTrivedi, BKAuerbach, BAskew, VDillon, LHanselman, JCLin, ZLu, GHRobertson, ASekerke, C Hepatoselectivity of statins: design and synthesis of 4-sulfamoyl pyrroles as HMG-CoA reductase inhibitors. Bioorg Med Chem Lett18:1151-6 (2008) 
 
3-hydroxy-3-methylglutaryl-coenzyme A reductase
Name:3-hydroxy-3-methylglutaryl-coenzyme A reductase
Type:Enzyme
Mol. Mass.:96689.85
Organism:Rattus norvegicus (rat)
Description:Isolated rat liver microsomes were used as enzyme source.
Residue:887
BDBM50231028
NameBDBM50231028
Synonyms:CHEMBL429487 | sodium (3R,5R)-7-(2-(4-fluorophenyl)-5-isopropyl-3-phenyl-4-(pyrrolidin-1-ylsulfonyl)-1H-pyrrol-1-yl)-3,5-dihydroxyheptanoate
TypeSmall organic molecule
Emp. Form.C30H36FN2O6S
Mol. Mass.571.681
SMILESCC(C)c1c(c(c(-c2ccc(F)cc2)n1CC[C@@H](O)C[C@@H](O)CC([O-])=O)-c1ccccc1)S(=O)(=O)N1CCCC1