Reaction Details
TargetCoagulation factor X
LigandBDBM50231268
Substrate/Competitorn/a
Meas. Tech.ChEMBL_460575 (CHEMBL926651)
Ki 147±n/a nM
Citation Lee, YKParks, DJLu, TThieu, TVMarkotan, TPan, WMcComsey, DFMilkiewicz, KLCrysler, CSNinan, NAbad, MCGiardino, ECMaryanoff, BEDamiano, BPPlayer, MR 7-fluoroindazoles as potent and selective inhibitors of factor Xa. J Med Chem51:282-97 (2008) 
 
Coagulation factor X
Name:Coagulation factor X
Type:Enzyme
Mol. Mass.:54726.60
Organism:Homo sapiens (Human)
Description:n/a
Residue:488
BDBM50231268
NameBDBM50231268
Synonyms:1-(3-aminobenzo[d]isoxazol-5-yl)-6-[4-(4-dimethylaminomethylpyridin-3-yl)-2-fluorophenyl]-7-fluoro-1H-indazole-3-carboxylicacid amide | CHEMBL400306
TypeSmall organic molecule
Emp. Form.C29H23F2N7O2
Mol. Mass.539.5354
SMILESCN(C)Cc1ccncc1-c1ccc(c(F)c1)-c1ccc2c(nn(-c3ccc4onc(N)c4c3)c2c1F)C(N)=O