Reaction Details
TargetCoagulation factor X
LigandBDBM50231272
Substrate/Competitorn/a
Meas. Tech.ChEMBL_460575 (CHEMBL926651)
Ki 15.9±n/a nM
Citation Lee, YKParks, DJLu, TThieu, TVMarkotan, TPan, WMcComsey, DFMilkiewicz, KLCrysler, CSNinan, NAbad, MCGiardino, ECMaryanoff, BEDamiano, BPPlayer, MR 7-fluoroindazoles as potent and selective inhibitors of factor Xa. J Med Chem51:282-97 (2008) 
 
Coagulation factor X
Name:Coagulation factor X
Type:Enzyme
Mol. Mass.:54726.60
Organism:Homo sapiens (Human)
Description:n/a
Residue:488
BDBM50231272
NameBDBM50231272
Synonyms:1-(3-amino-1,2-benzisoxazol-5-yl)-6-(4-{2-[(dimethylamino)methyl]-1H-imidazol-1-yl}-2-fluorophenyl)-7-fluoro-1H-indazole-3-carboxamide CHEMBL398870
TypeSmall organic molecule
Emp. Form.C27H22F2N8O2
Mol. Mass.528.5128
SMILESCN(C)Cc1nccn1-c1ccc(c(F)c1)-c1ccc2c(nn(-c3ccc4onc(N)c4c3)c2c1F)C(N)=O