Reaction Details
TargetCoagulation factor X
LigandBDBM50231286
Substrate/Competitorn/a
Meas. Tech.ChEMBL_460575 (CHEMBL926651)
Ki 124±n/a nM
Citation Lee, YKParks, DJLu, TThieu, TVMarkotan, TPan, WMcComsey, DFMilkiewicz, KLCrysler, CSNinan, NAbad, MCGiardino, ECMaryanoff, BEDamiano, BPPlayer, MR 7-fluoroindazoles as potent and selective inhibitors of factor Xa. J Med Chem51:282-97 (2008) 
 
Coagulation factor X
Name:Coagulation factor X
Type:Enzyme
Mol. Mass.:54726.60
Organism:Homo sapiens (Human)
Description:n/a
Residue:488
BDBM50231286
NameBDBM50231286
Synonyms:1-{4-[1-(3-aminomethylphenyl)-7-fluoro-3-methyl-1H-indazol-6-yl]phenyl}piperidin-2-one | CHEMBL400734
TypeSmall organic molecule
Emp. Form.C26H25FN4O
Mol. Mass.428.5013
SMILESCc1nn(-c2cccc(CN)c2)c2c(F)c(ccc12)-c1ccc(cc1)N1CCCCC1=O