Reaction Details
TargetBeta-secretase 1
LigandBDBM50231940
Substrate/Competitorn/a
Meas. Tech.ChEMBL_462108 (CHEMBL945886)
Ki 564±n/a nM
Citation Ghosh, AKKumaragurubaran, NHong, LKulkarni, SXu, XMiller, HBReddy, DSWeerasena, VTurner, RChang, WKoelsch, GTang, J Potent memapsin 2 (beta-secretase) inhibitors: design, synthesis, protein-ligand X-ray structure, and in vivo evaluation. Bioorg Med Chem Lett18:1031-6 (2008) 
 
Beta-secretase 1
Name:Beta-secretase 1
Type:Protein
Mol. Mass.:55755.10
Organism:Homo sapiens (Human)
Description:P56817
Residue:501
BDBM50231940
NameBDBM50231940
Synonyms:CHEMBL252276 | N1-((2S,3R)-3-hydroxy-4-((S)-1-(isopropylamino)-3-methyl-1-oxobutan-2-ylamino)-1-phenylbutan-2-yl)-5-(N-methylmethan-3-ylsulfonamido)-N3-((R)-1-phenylethyl)isophthalamide
TypeSmall organic molecule
Emp. Form.C36H49N5O6S
Mol. Mass.679.869
SMILESCC(C)NC(=O)[C@@H](NC[C@@H](O)[C@H](Cc1ccccc1)NC(=O)c1cc(cc(c1)C(=O)N[C@H](C)c1ccccc1)N(C)S(C)(=O)=O)C(C)C