Reaction Details
TargetBeta-secretase 1
LigandBDBM50231936
Substrate/Competitorn/a
Meas. Tech.ChEMBL_462108 (CHEMBL945886)
Ki 916±n/a nM
Citation Ghosh, AKKumaragurubaran, NHong, LKulkarni, SXu, XMiller, HBReddy, DSWeerasena, VTurner, RChang, WKoelsch, GTang, J Potent memapsin 2 (beta-secretase) inhibitors: design, synthesis, protein-ligand X-ray structure, and in vivo evaluation. Bioorg Med Chem Lett18:1031-6 (2008) 
 
Beta-secretase 1
Name:Beta-secretase 1
Type:Protein
Mol. Mass.:55755.10
Organism:Homo sapiens (Human)
Description:P56817
Residue:501
BDBM50231936
NameBDBM50231936
Synonyms:CHEMBL253931 | N1-((2R,3S)-1-(3-methoxybenzylamino)-2-hydroxy-5-methylhexan-3-yl)-5-(N-methylmethan-3-ylsulfonamido)-N3-((R)-1-phenylethyl)isophthalamide
TypeSmall organic molecule
Emp. Form.C33H44N4O6S
Mol. Mass.624.791
SMILESCOc1cccc(CNC[C@@H](O)[C@H](CC(C)C)NC(=O)c2cc(cc(c2)C(=O)N[C@H](C)c2ccccc2)N(C)S(C)(=O)=O)c1