Reaction Details
TargetCannabinoid receptor 2
LigandBDBM50234380
Substrate/Competitorn/a
Meas. Tech.ChEMBL_462576 (CHEMBL928502)
Ki 4±n/a nM
Citation Ermann, MRiether, DWalker, ERMushi, IFJenkins, JENoya-Marino, BBrewer, MLTaylor, MGAmouzegh, PEast, SPDymock, BWGemkow, MJKahrs, AFEbneth, ALöbbe, SO'Shea, KShih, DTThomson, D Arylsulfonamide CB2 receptor agonists: SAR and optimization of CB2 selectivity. Bioorg Med Chem Lett18:1725-9 (2008) 
 
Cannabinoid receptor 2
Name:Cannabinoid receptor 2
Type:G Protein-Coupled Receptor (GPCR)
Mol. Mass.:39690.94
Organism:Homo sapiens (Human)
Description:P34972
Residue:360
BDBM50234380
NameBDBM50234380
Synonyms:CHEMBL245876 | quinolin-8-yl 4-methyl-3-(piperidin-1-ylsulfonyl)benzoate
TypeSmall organic molecule
Emp. Form.C22H22N2O4S
Mol. Mass.410.486
SMILESCc1ccc(cc1S(=O)(=O)N1CCCCC1)C(=O)Oc1cccc2cccnc12