Reaction Details
TargetCannabinoid receptor 2
LigandBDBM50234396
Substrate/Competitorn/a
Meas. Tech.ChEMBL_462578 (CHEMBL928504)
EC50 5±n/a nM
Citation Ermann, MRiether, DWalker, ERMushi, IFJenkins, JENoya-Marino, BBrewer, MLTaylor, MGAmouzegh, PEast, SPDymock, BWGemkow, MJKahrs, AFEbneth, ALöbbe, SO'Shea, KShih, DTThomson, D Arylsulfonamide CB2 receptor agonists: SAR and optimization of CB2 selectivity. Bioorg Med Chem Lett18:1725-9 (2008) 
 
Cannabinoid receptor 2
Name:Cannabinoid receptor 2
Type:G Protein-Coupled Receptor (GPCR)
Mol. Mass.:39690.94
Organism:Homo sapiens (Human)
Description:P34972
Residue:360
BDBM50234396
NameBDBM50234396
Synonyms:(4-methyl-3-(morpholinosulfonyl)phenyl)(octahydroisoquinolin-2(1H)-yl)methanone | CHEMBL253074
TypeSmall organic molecule
Emp. Form.C21H30N2O4S
Mol. Mass.406.539
SMILESCc1ccc(cc1S(=O)(=O)N1CCOCC1)C(=O)N1CCC2CCCCC2C1