Reaction Details
TargetCannabinoid receptor 2
LigandBDBM50234400
Substrate/Competitorn/a
Meas. Tech.ChEMBL_462578 (CHEMBL928504)
EC50 6±n/a nM
Citation Ermann, MRiether, DWalker, ERMushi, IFJenkins, JENoya-Marino, BBrewer, MLTaylor, MGAmouzegh, PEast, SPDymock, BWGemkow, MJKahrs, AFEbneth, ALöbbe, SO'Shea, KShih, DTThomson, D Arylsulfonamide CB2 receptor agonists: SAR and optimization of CB2 selectivity. Bioorg Med Chem Lett18:1725-9 (2008) 
 
Cannabinoid receptor 2
Name:Cannabinoid receptor 2
Type:G Protein-Coupled Receptor (GPCR)
Mol. Mass.:39690.94
Organism:Homo sapiens (Human)
Description:P34972
Residue:360
BDBM50234400
NameBDBM50234400
Synonyms:4-methyl-N-(2-(methylsulfonyl)phenyl)-3-(piperidin-1-ylsulfonyl)benzamide | CHEMBL253463
TypeSmall organic molecule
Emp. Form.C20H24N2O5S2
Mol. Mass.436.545
SMILESCc1ccc(cc1S(=O)(=O)N1CCCCC1)C(=O)Nc1ccccc1S(C)(=O)=O