Reaction Details
TargetCannabinoid receptor 2
LigandBDBM50234421
Substrate/Competitorn/a
Meas. Tech.ChEMBL_462578 (CHEMBL928504)
EC50 119±n/a nM
Citation Ermann, MRiether, DWalker, ERMushi, IFJenkins, JENoya-Marino, BBrewer, MLTaylor, MGAmouzegh, PEast, SPDymock, BWGemkow, MJKahrs, AFEbneth, ALöbbe, SO'Shea, KShih, DTThomson, D Arylsulfonamide CB2 receptor agonists: SAR and optimization of CB2 selectivity. Bioorg Med Chem Lett18:1725-9 (2008) 
 
Cannabinoid receptor 2
Name:Cannabinoid receptor 2
Type:G Protein-Coupled Receptor (GPCR)
Mol. Mass.:39690.94
Organism:Homo sapiens (Human)
Description:P34972
Residue:360
BDBM50234421
NameBDBM50234421
Synonyms:CHEMBL253056 | N-cyclohexyl-N,4-dimethyl-3-(piperidin-1-ylsulfonyl)benzamide
TypeSmall organic molecule
Emp. Form.C20H30N2O3S
Mol. Mass.378.529
SMILESCN(C1CCCCC1)C(=O)c1ccc(C)c(c1)S(=O)(=O)N1CCCCC1