Reaction Details
Target1-phosphatidylinositol 4,5-bisphosphate phosphodiesterase gamma-1
LigandBDBM50242263
Substrate/Competitorn/a
Meas. Tech.ChEMBL_549444 (CHEMBL1019375)
IC50 12910±n/a nM
Citation Lee, JSCho, YSPark, EJKim, JOh, WKLee, HSAhn, JS Phospholipase Cgamma1 inhibitory principles from the sarcotestas of Ginkgo biloba. J Nat Prod61:867-71 (1998) 
 
1-phosphatidylinositol 4,5-bisphosphate phosphodiesterase gamma-1
Name:1-phosphatidylinositol 4,5-bisphosphate phosphodiesterase gamma-1
Type:PROTEIN
Mol. Mass.:148298.56
Organism:Bos taurus
Description:ChEMBL_549444
Residue:1291
BDBM50242263
NameBDBM50242263
Synonyms:(Z)-3-(pentadec-8-enyl)phenol 5-{8(Z)-pentadecenyl}phenol | CHEMBL470263
TypeSmall organic molecule
Emp. Form.C21H34O
Mol. Mass.302.4941
SMILESCCCCCC\C=C/CCCCCCCc1cccc(O)c1