Reaction Details
Target1-phosphatidylinositol 4,5-bisphosphate phosphodiesterase gamma-1
LigandBDBM50259933
Substrate/Competitorn/a
Meas. Tech.ChEMBL_549444 (CHEMBL1019375)
IC50 72320±n/a nM
Citation Lee, JSCho, YSPark, EJKim, JOh, WKLee, HSAhn, JS Phospholipase Cgamma1 inhibitory principles from the sarcotestas of Ginkgo biloba. J Nat Prod61:867-71 (1998) 
 
1-phosphatidylinositol 4,5-bisphosphate phosphodiesterase gamma-1
Name:1-phosphatidylinositol 4,5-bisphosphate phosphodiesterase gamma-1
Type:PROTEIN
Mol. Mass.:148298.56
Organism:Bos taurus
Description:ChEMBL_549444
Residue:1291
BDBM50259933
NameBDBM50259933
Synonyms:5-tridecyl resorcinol CHEMBL451044
TypeSmall organic molecule
Emp. Form.C19H32O2
Mol. Mass.292.4562
SMILESCCCCCCCCCCCCCc1cc(O)cc(O)c1