Reaction Details
Target1-phosphatidylinositol 4,5-bisphosphate phosphodiesterase gamma-1
LigandBDBM50259929
Substrate/Competitorn/a
Meas. Tech.ChEMBL_549443 (CHEMBL1019374)
IC50 87950±n/a nM
Citation Lee, JSCho, YSPark, EJKim, JOh, WKLee, HSAhn, JS Phospholipase Cgamma1 inhibitory principles from the sarcotestas of Ginkgo biloba. J Nat Prod61:867-71 (1998) 
 
1-phosphatidylinositol 4,5-bisphosphate phosphodiesterase gamma-1
Name:1-phosphatidylinositol 4,5-bisphosphate phosphodiesterase gamma-1
Type:PROTEIN
Mol. Mass.:148298.56
Organism:Bos taurus
Description:ChEMBL_549444
Residue:1291
BDBM50259929
NameBDBM50259929
Synonyms:3-tridecyl phenol | CHEMBL448270
TypeSmall organic molecule
Emp. Form.C19H32O
Mol. Mass.276.4568
SMILESCCCCCCCCCCCCCc1cccc(O)c1