Reaction Details
Target1-phosphatidylinositol 4,5-bisphosphate phosphodiesterase gamma-1
LigandBDBM50082305
Substrate/Competitorn/a
Meas. Tech.ChEMBL_549443 (CHEMBL1019374)
IC50 92580±n/a nM
Citation Lee, JSCho, YSPark, EJKim, JOh, WKLee, HSAhn, JS Phospholipase Cgamma1 inhibitory principles from the sarcotestas of Ginkgo biloba. J Nat Prod61:867-71 (1998) 
 
1-phosphatidylinositol 4,5-bisphosphate phosphodiesterase gamma-1
Name:1-phosphatidylinositol 4,5-bisphosphate phosphodiesterase gamma-1
Type:PROTEIN
Mol. Mass.:148298.56
Organism:Bos taurus
Description:ChEMBL_549444
Residue:1291
BDBM50082305
NameBDBM50082305
Synonyms:3-Pentadecyl-phenol 3-pentadecylphenol CHEMBL34689
TypeSmall organic molecule
Emp. Form.C21H36O
Mol. Mass.304.5099
c1cccc(O)c1