Reaction Details
TargetDNA polymerase beta
LigandBDBM50250348
Substrate/Competitorn/a
Meas. Tech.ChEMBL_528872 (CHEMBL978545)
IC50 22000±n/a nM
Citation Sun, DAStarck, SRLocke, EPHecht, SM DNA polymerase beta inhibitors from Sandoricum koetjape. J Nat Prod62:1110-3 (1999) 
 
DNA polymerase beta
Name:DNA polymerase beta
Type:PROTEIN
Mol. Mass.:38334.34
Organism:Rattus norvegicus
Description:ChEMBL_1361926
Residue:335
BDBM50250348
NameBDBM50250348
Synonyms:3-oxo-olean-12-en-29-oic acid CHEMBL491702
TypeSmall organic molecule
Emp. Form.C30H46O3
Mol. Mass.454.6844
SMILESCC1(C)[C@@H]2CC[C@]3(C)[C@H](CC=C4[C@@H]5C[C@@](C)(CC[C@]5(C)CC[C@@]34C)C(O)=O)[C@@]2(C)CCC1=O