Reaction Details
TargetDNA polymerase beta
LigandBDBM50250360
Substrate/Competitorn/a
Meas. Tech.ChEMBL_528872 (CHEMBL978545)
IC50 35000±n/a nM
Citation Sun, DAStarck, SRLocke, EPHecht, SM DNA polymerase beta inhibitors from Sandoricum koetjape. J Nat Prod62:1110-3 (1999) 
 
DNA polymerase beta
Name:DNA polymerase beta
Type:PROTEIN
Mol. Mass.:38334.34
Organism:Rattus norvegicus
Description:ChEMBL_1361926
Residue:335
BDBM50250360
NameBDBM50250360
Synonyms:3-benzyloximo-olean-12-en-29-oic acid | CHEMBL455762
TypeSmall organic molecule
Emp. Form.C37H53NO3
Mol. Mass.559.8216
SMILESC[C@]12CC[C@](C)(C[C@H]1C1=CC[C@@H]3[C@@]4(C)CC\C(=N\OCc5ccccc5)C(C)(C)[C@@H]4CC[C@@]3(C)[C@]1(C)CC2)C(O)=O