Reaction Details
TargetCathepsin K
LigandBDBM50260286
Substrate/Competitorn/a
Meas. Tech.ChEMBL_506978 (CHEMBL938814)
IC50 98±n/a nM
Citation Patil, ADFreyer, AJKillmer, LOffen, PTaylor, PBVotta, BJJohnson, RK A new dimeric dihydrochalcone and a new prenylated flavone from the bud covers of Artocarpus altilis: potent inhibitors of cathepsin K. J Nat Prod65:624-7 (2002) Cathepsin K
Name:Cathepsin K
Type:Enzyme
Mol. Mass.:36975.68
Organism:Homo sapiens (Human)
Description:P43235
Residue:329
BDBM50260286
NameBDBM50260286
Synonyms:CHEMBL508746 | cycloaltilisin 6
TypeSmall organic molecule
Emp. Form.C50H58O10
Mol. Mass.818.9895
SMILES[#6]\[#6](-[#6])=[#6]\[#6]-[#6]-[#6](-[#6])=[#6]-[#6]-c1c(-[#6]-[#6]-[#6](=O)-c2ccc(-[#8])cc2-[#8])cc(c(-[#8])c1-[#8])-c1cc(-[#8])c(-[#8])c(-[#6]-[#6]=[#6](-[#6])-[#6]-[#6]\[#6]=[#6](\[#6])-[#6])c1-[#6]-[#6]-[#6](=O)-c1ccc(-[#8])cc1-[#8]