Reaction Details
TargetEnoyl-[acyl-carrier-protein] reductase [NADH]
LigandBDBM8726
Substrate/Competitorn/a
Meas. Tech.ChEMBL_509155 (CHEMBL1008999)
IC50 3000±n/a nM
Citation Cao, SLee, ASHuang, YFlotow, HNg, SButler, MSBuss, AD Agonodepsides a and B: two new depsides from a filamentous fungus F7524. J Nat Prod65:1037-8 (2002) Enoyl-[acyl-carrier-protein] reductase [NADH]
Name:Enoyl-[acyl-carrier-protein] reductase [NADH]
Type:Enzyme
Mol. Mass.:28526.00
Organism:Mycobacterium tuberculosis (strain ATCC 25618 / H37Rv)
Description:P9WGR1
Residue:269
BDBM8726
NameBDBM8726
Synonyms:5-chloro-2-(2,4-dichlorophenoxy)phenol TCL US20230414581, Compound 35
TypeSmall organic molecule
Emp. Form.C12H7Cl3O2
Mol. Mass.289.542
SMILESOc1cc(Cl)ccc1Oc1ccc(Cl)cc1Cl