Reaction Details
TargetBeta-glucosidase A
LigandBDBM18351
Substrate/Competitorn/a
Meas. Tech.ChEMBL_545875 (CHEMBL1034390)
IC50 100000±n/a nM
Citation Yamashita, TYasuda, KKizu, HKameda, YWatson, AANash, RJFleet, GWAsano, N New polyhydroxylated pyrrolidine, piperidine, and pyrrolizidine alkaloids from Scilla sibirica. J Nat Prod65:1875-81 (2002) 
 
Beta-glucosidase A
Name:Beta-glucosidase A
Type:PROTEIN
Mol. Mass.:53484.21
Organism:Caldocellum saccharolyticum
Description:ChEMBL_37437
Residue:455
BDBM18351
NameBDBM18351
Synonyms:(2R,3R,4R,5S)-2-(Hydroxymethyl)piperidine-3,4,5-triol, 10 1-Deoxynojirimycin CHEMBL307429 US9181184, 1 | dNM
Typenatural product
Emp. Form.C6H13NO4
Mol. Mass.163.1717
SMILESOC[C@H]1NC[C@H](O)[C@@H](O)[C@@H]1O