Reaction Details
TargetDNA polymerase beta
LigandBDBM50241924
Substrate/Competitorn/a
Meas. Tech.ChEMBL_550664 (CHEMBL1002759)
IC50 73000±n/a nM
Citation Massiot, GLong, CDavid, BSerrano, MJDaubié, FAlby, FAusseil, FKnibiehler, MMoretti, CHoffmann, JSCazaux, CLavaud, C Acylphloroglucinol derivatives from Mahurea palustris. J Nat Prod68:979-84 (2005) 
 
DNA polymerase beta
Name:DNA polymerase beta
Type:Protein
Mol. Mass.:38188.76
Organism:Homo sapiens (Human)
Description:n/a
Residue:335
BDBM50241924
NameBDBM50241924
Synonyms:CHEMBL486797 | Mahureone B
TypeSmall organic molecule
Emp. Form.C35H46O6
Mol. Mass.562.7361
SMILES[#6]-[#6]-[#6](-[#6])-[#6](=O)-[#6]-1-[#6](=O)-[#8]-[#6]2=[#6](-[#6](-[#6]-[#6](-[#8])=O)-c3ccccc3)C([#6])([#6])[#6](-[#6]\[#6]=[#6](\[#6])-[#6])-[#6]C2([#6]\[#6]=[#6](\[#6])-[#6])[#6]-1=O