Reaction Details
Target5-hydroxytryptamine receptor 7
LigandBDBM50259746
Substrate/Competitorn/a
Meas. Tech.ChEMBL_528821 (CHEMBL977663)
IC50 47600±n/a nM
Citation Deng, SChen, SNYao, PNikolic, Dvan Breemen, RBBolton, JLFong, HHFarnsworth, NRPauli, GF Serotonergic activity-guided phytochemical investigation of the roots of Angelica sinensis. J Nat Prod69:536-41 (2006) 
 
5-hydroxytryptamine receptor 7
Name:5-hydroxytryptamine receptor 7
Type:G Protein-Coupled Receptor (GPCR)
Mol. Mass.:53573.08
Organism:Homo sapiens (Human)
Description:P34969
Residue:479
BDBM50259746
NameBDBM50259746
Synonyms:(4-Hydroxyphenyl)ethyl trans-ferulate p-Hydroxyphenethyl trans-ferulate (18) | p-hydroxyphenethyl trans-ferulate
TypeSmall organic molecule
Emp. Form.C18H18O5
Mol. Mass.314.3325
SMILESCOc1cc(\C=C\C(=O)OCCc2ccc(O)cc2)ccc1O