Reaction Details
TargetXanthine dehydrogenase/oxidase
LigandBDBM50134399
Substrate/Competitorn/a
Meas. Tech.ChEMBL_511322 (CHEMBL996977)
Ki 70000±n/a nM
Citation Reigan, PGbaj, AStratford, IJBryce, RAFreeman, S Xanthine oxidase-activated prodrugs of thymidine phosphorylase inhibitors. Eur J Med Chem43:1248-60 (2008) 
 
Xanthine dehydrogenase/oxidase
Name:Xanthine dehydrogenase/oxidase
Type:Protein
Mol. Mass.:146809.00
Organism:Bos taurus (Bovine)
Description:P80457
Residue:1332
BDBM50134399
NameBDBM50134399
Synonyms:1,7-Dihydro-pyrrolo[2,3-d]pyrimidine-2,4-dione 7-deazaxanthine | CHEMBL122899
TypeSmall organic molecule
Emp. Form.C6H5N3O2
Mol. Mass.151.1228
SMILESO=c1[nH]c2[nH]ccc2c(=O)[nH]1