Reaction Details
TargetcGMP-dependent protein kinase
LigandBDBM50265429
Substrate/Competitorn/a
Meas. Tech.ChEMBL_496992 (CHEMBL1005407)
IC50 0.11±n/a nM
Citation Scribner, ADennis, RLee, SOuvry, GPerrey, DFisher, MWyvratt, MLeavitt, PLiberator, PGurnett, ABrown, CMathew, JThompson, DSchmatz, DBiftu, T Synthesis and biological activity of imidazopyridine anticoccidial agents: Part II. Eur J Med Chem43:1123-51 (2008) 
 
cGMP-dependent protein kinase
Name:cGMP-dependent protein kinase
Synonyms:n/a
Type:PROTEIN
Mol. Mass.:112911.27
Organism:Eimeria tenella
Description:ChEMBL_469577
Residue:1003
BDBM50265429
NameBDBM50265429
TypeSmall organic molecule
Emp. Form.C29H27FN6
Mol. Mass.478.5633
SMILESNc1nccc(n1)-c1c(nc2cc(ccn12)C1CCN(Cc2ccccc2)CC1)-c1ccc(F)cc1