Reaction Details
TargetcGMP-dependent protein kinase
LigandBDBM50182369
Substrate/Competitorn/a
Meas. Tech.ChEMBL_496992 (CHEMBL1005407)
IC50 0.044±n/a nM
Citation Scribner, ADennis, RLee, SOuvry, GPerrey, DFisher, MWyvratt, MLeavitt, PLiberator, PGurnett, ABrown, CMathew, JThompson, DSchmatz, DBiftu, T Synthesis and biological activity of imidazopyridine anticoccidial agents: Part II. Eur J Med Chem43:1123-51 (2008) 
 
cGMP-dependent protein kinase
Name:cGMP-dependent protein kinase
Synonyms:n/a
Type:PROTEIN
Mol. Mass.:112911.27
Organism:Eimeria tenella
Description:ChEMBL_469577
Residue:1003
BDBM50182369
NameBDBM50182369
TypeSmall organic molecule
Emp. Form.C23H23FN6
Mol. Mass.402.4673
SMILESCN1CCC(CC1)c1ccn2c(c(nc2c1)-c1ccc(F)cc1)-c1ccnc(N)n1