Reaction Details
TargetAromatase
LigandBDBM50148911
Substrate/Competitorn/a
Meas. Tech.ChEMBL_512098 (CHEMBL978974)
IC50 32000±n/a nM
Citation Gnoatto, SCDassonville-Klimpt, ADa Nascimento, SGaléra, PBoumediene, KGosmann, GSonnet, PMoslemi, S Evaluation of ursolic acid isolated from Ilex paraguariensis and derivatives on aromatase inhibition. Eur J Med Chem43:1865-77 (2008) 
 
Aromatase
Name:Aromatase
Type:Enzyme
Mol. Mass.:57888.92
Organism:Homo sapiens (Human)
Description:P11511
Residue:503
BDBM50148911
NameBDBM50148911
Synonyms:(3beta)-3-hydroxyurs-12-en-28-oic acid CHEMBL169 malol urson
TypeSmall organic molecule
Emp. Form.C30H48O3
Mol. Mass.456.7003
SMILESC[C@@H]1CC[C@@]2(CC[C@]3(C)C(=CC[C@@H]4[C@@]5(C)CC[C@H](O)C(C)(C)[C@@H]5CC[C@@]34C)[C@@H]2[C@H]1C)C(O)=O