Reaction Details
TargetCannabinoid receptor 1
LigandBDBM50242565
Substrate/Competitorn/a
Meas. Tech.ChEMBL_534564 (CHEMBL988125)
IC50 273±n/a nM
Citation Song, KSLee, SHChun, HJKim, JYJung, MEAhn, KKim, SUKim, JLee, J Design, synthesis and biological evaluation of piperazine analogues as CB1 cannabinoid receptor ligands. Bioorg Med Chem16:4035-51 (2008) 
 
Cannabinoid receptor 1
Name:Cannabinoid receptor 1
Type:G Protein-Coupled Receptor (GPCR)
Mol. Mass.:52868.96
Organism:Homo sapiens (Human)
Description:P21554
Residue:472
BDBM50242565
NameBDBM50242565
Synonyms:4-((2-Chlorophenyl)(4-chlorophenyl)methyl)-N-(cyclohexylmethyl)piperazine-1-carboxamide | CHEMBL487854
TypeSmall organic molecule
Emp. Form.C25H31Cl2N3O
Mol. Mass.460.439
SMILESClc1ccc(cc1)C(N1CCN(CC1)C(=O)NCC1CCCCC1)c1ccccc1Cl