Reaction Details
TargetCannabinoid receptor 1
LigandBDBM50242556
Substrate/Competitorn/a
Meas. Tech.ChEMBL_534564 (CHEMBL988125)
IC50 441±n/a nM
Citation Song, KSLee, SHChun, HJKim, JYJung, MEAhn, KKim, SUKim, JLee, J Design, synthesis and biological evaluation of piperazine analogues as CB1 cannabinoid receptor ligands. Bioorg Med Chem16:4035-51 (2008) 
 
Cannabinoid receptor 1
Name:Cannabinoid receptor 1
Type:G Protein-Coupled Receptor (GPCR)
Mol. Mass.:52868.96
Organism:Homo sapiens (Human)
Description:P21554
Residue:472
BDBM50242556
NameBDBM50242556
Synonyms:4-((4-Chlorophenyl)(2,3-dichlorophenyl)methyl)-N-cyclohexylpiperazine-1-carboxamide | CHEMBL487853
TypeSmall organic molecule
Emp. Form.C24H28Cl3N3O
Mol. Mass.480.858
SMILESClc1ccc(cc1)C(N1CCN(CC1)C(=O)NC1CCCCC1)c1cccc(Cl)c1Cl