Reaction Details
TargetCannabinoid receptor 1
LigandBDBM50242557
Substrate/Competitorn/a
Meas. Tech.ChEMBL_534564 (CHEMBL988125)
IC50 729±n/a nM
Citation Song, KSLee, SHChun, HJKim, JYJung, MEAhn, KKim, SUKim, JLee, J Design, synthesis and biological evaluation of piperazine analogues as CB1 cannabinoid receptor ligands. Bioorg Med Chem16:4035-51 (2008) 
 
Cannabinoid receptor 1
Name:Cannabinoid receptor 1
Type:G Protein-Coupled Receptor (GPCR)
Mol. Mass.:52868.96
Organism:Homo sapiens (Human)
Description:P21554
Residue:472
BDBM50242557
NameBDBM50242557
Synonyms:4-((4-Chlorophenyl)(2,4-dichlorophenyl)methyl)-N-cycloheptylpiperazine-1-carboxamide | CHEMBL487676
TypeSmall organic molecule
Emp. Form.C25H30Cl3N3O
Mol. Mass.494.884
SMILESClc1ccc(cc1)C(N1CCN(CC1)C(=O)NC1CCCCCC1)c1ccc(Cl)cc1Cl