Reaction Details
TargetCannabinoid receptor 2
LigandBDBM50251133
Substrate/Competitorn/a
Meas. Tech.ChEMBL_534563 (CHEMBL988124)
IC50 4950±n/a nM
Citation Song, KSLee, SHChun, HJKim, JYJung, MEAhn, KKim, SUKim, JLee, J Design, synthesis and biological evaluation of piperazine analogues as CB1 cannabinoid receptor ligands. Bioorg Med Chem16:4035-51 (2008) 
 
Cannabinoid receptor 2
Name:Cannabinoid receptor 2
Type:G Protein-Coupled Receptor (GPCR)
Mol. Mass.:39690.94
Organism:Homo sapiens (Human)
Description:P34972
Residue:360
BDBM50251133
NameBDBM50251133
Synonyms:4-((4-Bromophenyl)(2-chlorophenyl)methyl)-N-tert-butylpiperazine-1-carboxamide | CHEMBL463846
TypeSmall organic molecule
Emp. Form.C22H27BrClN3O
Mol. Mass.464.826
SMILESCC(C)(C)NC(=O)N1CCN(CC1)C(c1ccc(Br)cc1)c1ccccc1Cl