Reaction Details
TargetCannabinoid receptor 2
LigandBDBM50251130
Substrate/Competitorn/a
Meas. Tech.ChEMBL_534563 (CHEMBL988124)
IC50>10000±n/a nM
Citation Song, KSLee, SHChun, HJKim, JYJung, MEAhn, KKim, SUKim, JLee, J Design, synthesis and biological evaluation of piperazine analogues as CB1 cannabinoid receptor ligands. Bioorg Med Chem16:4035-51 (2008) 
 
Cannabinoid receptor 2
Name:Cannabinoid receptor 2
Type:G Protein-Coupled Receptor (GPCR)
Mol. Mass.:39690.94
Organism:Homo sapiens (Human)
Description:P34972
Residue:360
BDBM50251130
NameBDBM50251130
Synonyms:4-((4-Bromophenyl)(2-chlorophenyl)methyl)-Ncyclohexylpiperazine-1-carboxamide | CHEMBL464872
TypeSmall organic molecule
Emp. Form.C24H29BrClN3O
Mol. Mass.490.864
SMILESClc1ccccc1C(N1CCN(CC1)C(=O)NC1CCCCC1)c1ccc(Br)cc1