Reaction Details
TargetCannabinoid receptor 2
LigandBDBM50242565
Substrate/Competitorn/a
Meas. Tech.ChEMBL_534563 (CHEMBL988124)
IC50>10000±n/a nM
Citation Song, KSLee, SHChun, HJKim, JYJung, MEAhn, KKim, SUKim, JLee, J Design, synthesis and biological evaluation of piperazine analogues as CB1 cannabinoid receptor ligands. Bioorg Med Chem16:4035-51 (2008) 
 
Cannabinoid receptor 2
Name:Cannabinoid receptor 2
Type:G Protein-Coupled Receptor (GPCR)
Mol. Mass.:39690.94
Organism:Homo sapiens (Human)
Description:P34972
Residue:360
BDBM50242565
NameBDBM50242565
Synonyms:4-((2-Chlorophenyl)(4-chlorophenyl)methyl)-N-(cyclohexylmethyl)piperazine-1-carboxamide | CHEMBL487854
TypeSmall organic molecule
Emp. Form.C25H31Cl2N3O
Mol. Mass.460.439
SMILESClc1ccc(cc1)C(N1CCN(CC1)C(=O)NCC1CCCCC1)c1ccccc1Cl