Reaction Details
TargetCannabinoid receptor 1
LigandBDBM50251118
Substrate/Competitorn/a
Meas. Tech.ChEMBL_534562 (CHEMBL988123)
IC50 229±n/a nM
Citation Song, KSLee, SHChun, HJKim, JYJung, MEAhn, KKim, SUKim, JLee, J Design, synthesis and biological evaluation of piperazine analogues as CB1 cannabinoid receptor ligands. Bioorg Med Chem16:4035-51 (2008) 
 
Cannabinoid receptor 1
Name:Cannabinoid receptor 1
Type:G Protein-Coupled Receptor (GPCR)
Mol. Mass.:52856.55
Organism:Rattus norvegicus (rat)
Description:P20272
Residue:473
BDBM50251118
NameBDBM50251118
Synonyms:2-(4-((2-Chlorophenyl)(4-chlorophenyl)methyl)-piperazin-1-yl)-N-cycloheptyl-2-oxoacetamide | CHEMBL465530
TypeSmall organic molecule
Emp. Form.C26H31Cl2N3O2
Mol. Mass.488.449
SMILESClc1ccc(cc1)C(N1CCN(CC1)C(=O)C(=O)NC1CCCCCC1)c1ccccc1Cl