Reaction Details
TargetPyruvate kinase
LigandBDBM50270345
Substrate/Competitorn/a
Meas. Tech.ChEMBL_530311 (CHEMBL980373)
IC50 2300000±n/a nM
Citation Nowicki, MWTulloch, LBWorralll, LMcNae, IWHannaert, VMichels, PAFothergill-Gilmore, LAWalkinshaw, MDTurner, NJ Design, synthesis and trypanocidal activity of lead compounds based on inhibitors of parasite glycolysis. Bioorg Med Chem16:5050-61 (2008) 
 
Pyruvate kinase
Name:Pyruvate kinase
Type:PROTEIN
Mol. Mass.:54404.51
Organism:Leishmania mexicana
Description:ChEMBL_530311
Residue:499
BDBM50270345
NameBDBM50270345
Synonyms:(2R,3S,4S,5R)-2-(hydroxymethyl)-5-(((S)-3-methylbutan-2-ylamino)methyl)-tetrahydrofuran-3,4-diol | CHEMBL478296
TypeSmall organic molecule
Emp. Form.C11H23NO4
Mol. Mass.233.3046
SMILESCC(C)[C@H](C)NC[C@H]1O[C@H](CO)[C@@H](O)[C@@H]1O