Reaction Details
TargetATP-dependent 6-phosphofructokinase
LigandBDBM50270447
Substrate/Competitorn/a
Meas. Tech.ChEMBL_530309 (CHEMBL980371)
IC50 49000±n/a nM
Citation Nowicki, MWTulloch, LBWorralll, LMcNae, IWHannaert, VMichels, PAFothergill-Gilmore, LAWalkinshaw, MDTurner, NJ Design, synthesis and trypanocidal activity of lead compounds based on inhibitors of parasite glycolysis. Bioorg Med Chem16:5050-61 (2008) 
 
ATP-dependent 6-phosphofructokinase
Name:ATP-dependent 6-phosphofructokinase
Type:PROTEIN
Mol. Mass.:53537.94
Organism:Trypanosoma brucei
Description:ChEMBL_1288121
Residue:487
BDBM50270447
NameBDBM50270447
Synonyms:(2S,3S,4S,5R)-N-(3,4-dichlorobenzyl)-5-((cycloheptylamino)methyl)-3,4-dihydroxy-tetrahydrofuran-2-carboxamide | CHEMBL518599
TypeSmall organic molecule
Emp. Form.C20H28Cl2N2O4
Mol. Mass.431.353
SMILESO[C@H]1[C@H](O)[C@H](O[C@@H]1CNC1CCCCCC1)C(=O)NCc1ccc(Cl)c(Cl)c1