Reaction Details
TargetATP-dependent 6-phosphofructokinase
LigandBDBM50270348
Substrate/Competitorn/a
Meas. Tech.ChEMBL_530309 (CHEMBL980371)
IC50 50000±n/a nM
Citation Nowicki, MWTulloch, LBWorralll, LMcNae, IWHannaert, VMichels, PAFothergill-Gilmore, LAWalkinshaw, MDTurner, NJ Design, synthesis and trypanocidal activity of lead compounds based on inhibitors of parasite glycolysis. Bioorg Med Chem16:5050-61 (2008) 
 
ATP-dependent 6-phosphofructokinase
Name:ATP-dependent 6-phosphofructokinase
Type:PROTEIN
Mol. Mass.:53537.94
Organism:Trypanosoma brucei
Description:ChEMBL_1288121
Residue:487
BDBM50270348
NameBDBM50270348
Synonyms:(2S,3S,4S,5R)-5-((3,4-dichlorobenzylamino)methyl)-N-allyl-3,4-dihydroxy-tetrahydrofuran-2-carboxamide | CHEMBL477106
TypeSmall organic molecule
Emp. Form.C16H20Cl2N2O4
Mol. Mass.375.247
SMILESO[C@H]1[C@H](O)[C@H](O[C@@H]1CNCc1ccc(Cl)c(Cl)c1)C(=O)NCC=C