Reaction Details
TargetCholinesterase
LigandBDBM50261238
Substrate/Competitorn/a
Meas. Tech.ChEMBL_555910 (CHEMBL956646)
IC50 74100±n/a nM
Citation Rizzo, SRivière, CPiazzi, LBisi, AGobbi, SBartolini, MAndrisano, VMorroni, FTarozzi, AMonti, JPRampa, A Benzofuran-based hybrid compounds for the inhibition of cholinesterase activity, beta amyloid aggregation, and abeta neurotoxicity. J Med Chem51:2883-6 (2008) 
 
Cholinesterase
Name:Cholinesterase
Type:Homotetramer
Mol. Mass.:68422.27
Organism:Homo sapiens (Human)
Description:P06276
Residue:602
BDBM50261238
NameBDBM50261238
Synonyms:(2-{4-[7-(benzylmethylamino)heptyloxy]phenyl}benzofuran-3-yl)-(3,4-dimethoxyphenyl)-methanone | CHEMBL504674
TypeSmall organic molecule
Emp. Form.C38H41NO5
Mol. Mass.591.7358
SMILESCOc1ccc(cc1OC)C(=O)c1c(oc2ccccc12)-c1ccc(OCCCCCCCN(C)Cc2ccccc2)cc1