Reaction Details
TargetLysophosphatidic acid receptor 2
LigandBDBM50271763
Substrate/Competitorn/a
Meas. Tech.ChEMBL_556426 (CHEMBL955643)
Ki 20.8±n/a nM
Citation Fells, JITsukahara, RFujiwara, YLiu, JPerygin, DHOsborne, DATigyi, GParrill, AL Identification of non-lipid LPA3 antagonists by virtual screening. Bioorg Med Chem16:6207-17 (2008) 
 
Lysophosphatidic acid receptor 2
Name:Lysophosphatidic acid receptor 2
Type:PROTEIN
Mol. Mass.:39103.44
Organism:Homo sapiens (Human)
Description:ChEMBL_1451385
Residue:351
BDBM50271763
NameBDBM50271763
Synonyms:3-[3-(3-Carboxy-acryloylamino)-phenylcarbamoyl]-acrylic acid CHEMBL519002
TypeSmall organic molecule
Emp. Form.C14H12N2O6
Mol. Mass.304.2549
SMILESOC(=O)\C=C\C(=O)Nc1cccc(NC(=O)\C=C\C(O)=O)c1