Reaction Details
TargetHepatocyte growth factor receptor
LigandBDBM50272049
Substrate/Competitorn/a
Meas. Tech.ChEMBL_555860 (CHEMBL953404)
IC50 2±n/a nM
Citation Cai, ZWWei, DSchroeder, GMCornelius, LAKim, KChen, XTSchmidt, RJWilliams, DKTokarski, JSAn, YSack, JSManne, VKamath, AZhang, YMarathe, PHunt, JTLombardo, LJFargnoli, JBorzilleri, RM Discovery of orally active pyrrolopyridine- and aminopyridine-based Met kinase inhibitors. Bioorg Med Chem Lett18:3224-9 (2008) 
 
Hepatocyte growth factor receptor
Name:Hepatocyte growth factor receptor
Type:Protein
Mol. Mass.:155559.73
Organism:Homo sapiens (Human)
Description:P08581
Residue:1390
BDBM50272049
NameBDBM50272049
Synonyms:1-(4-(2-amino-3-ethynylpyridin-4-yloxy)-3-fluorophenyl)-3-(2-(4-fluorophenyl)acetyl)urea | CHEMBL502531
TypeSmall organic molecule
Emp. Form.C22H16F2N4O3
Mol. Mass.422.3842
SMILESNc1nccc(Oc2ccc(NC(=O)NC(=O)Cc3ccc(F)cc3)cc2F)c1C#C