Reaction Details
TargetCytochrome P450 3A4
LigandBDBM50272049
Substrate/Competitorn/a
Meas. Tech.ChEMBL_555862 (CHEMBL953406)
IC50 800±n/a nM
Citation Cai, ZWWei, DSchroeder, GMCornelius, LAKim, KChen, XTSchmidt, RJWilliams, DKTokarski, JSAn, YSack, JSManne, VKamath, AZhang, YMarathe, PHunt, JTLombardo, LJFargnoli, JBorzilleri, RM Discovery of orally active pyrrolopyridine- and aminopyridine-based Met kinase inhibitors. Bioorg Med Chem Lett18:3224-9 (2008) 
 
Cytochrome P450 3A4
Name:Cytochrome P450 3A4
Type:Enzyme
Mol. Mass.:57349.57
Organism:Homo sapiens (Human)
Description:n/a
Residue:503
BDBM50272049
NameBDBM50272049
Synonyms:1-(4-(2-amino-3-ethynylpyridin-4-yloxy)-3-fluorophenyl)-3-(2-(4-fluorophenyl)acetyl)urea | CHEMBL502531
TypeSmall organic molecule
Emp. Form.C22H16F2N4O3
Mol. Mass.422.3842
SMILESNc1nccc(Oc2ccc(NC(=O)NC(=O)Cc3ccc(F)cc3)cc2F)c1C#C