Reaction Details
TargetMitogen-activated protein kinase 10
LigandBDBM50271563
Substrate/Competitorn/a
Meas. Tech.ChEMBL_556512 (CHEMBL956507)
IC50 3±n/a nM
Citation Buckley, GMCeska, TAFraser, JLGowers, LGroom, CRHigueruelo, APJenkins, KMack, SRMorgan, TParry, DMPitt, WRRausch, ORichard, MDSabin, V IRAK-4 inhibitors. Part II: a structure-based assessment of imidazo[1,2-a]pyridine binding. Bioorg Med Chem Lett18:3291-5 (2008) 
 
Mitogen-activated protein kinase 10
Name:Mitogen-activated protein kinase 10
Type:Enzyme
Mol. Mass.:52586.89
Organism:Homo sapiens (Human)
Description:n/a
Residue:464
BDBM50271563
NameBDBM50271563
Synonyms:CHEMBL482708 N-cyclohexyl-4-imidazo[1,2-a]pyridin-3-yl-N-methylpyrimidin-2-amine
TypeSmall organic molecule
Emp. Form.C18H21N5
Mol. Mass.307.3928
SMILESCN(C1CCCCC1)c1nccc(n1)-c1cnc2ccccn12