Reaction Details
TargetSodium channel protein type 10 subunit alpha
LigandBDBM50231775
Substrate/Competitorn/a
Meas. Tech.ChEMBL_552563 (CHEMBL954007)
IC50 1000±n/a nM
Citation Drizin, IGregg, RJScanio, MJShi, LGross, MFAtkinson, RNThomas, JBJohnson, MSCarroll, WAMarron, BEChapman, MLLiu, DKrambis, MJShieh, CCZhang, XHernandez, GGauvin, DMMikusa, JPZhu, CZJoshi, SHonore, PMarsh, KCRoeloffs, RWerness, SKrafte, DSJarvis, MFFaltynek, CRKort, ME Discovery of potent furan piperazine sodium channel blockers for treatment of neuropathic pain. Bioorg Med Chem16:6379-86 (2008) 
 
Sodium channel protein type 10 subunit alpha
Name:Sodium channel protein type 10 subunit alpha
Type:Enzyme
Mol. Mass.:220609.21
Organism:Homo sapiens (Human)
Description:Q9Y5Y9
Residue:1956
BDBM50231775
NameBDBM50231775
Synonyms:(R)-5-(4-chlorophenyl)-N-(1-(4-(3-(4-(cyclopropanecarbonyl)phenoxy)propyl)piperazin-1-yl)-1-oxopropan-2-yl)furan-2-carboxamide | CHEMBL251241
TypeSmall organic molecule
Emp. Form.C31H34ClN3O5
Mol. Mass.564.072
SMILESC[C@@H](NC(=O)c1ccc(o1)-c1ccc(Cl)cc1)C(=O)N1CCN(CCCOc2ccc(cc2)C(=O)C2CC2)CC1