Reaction Details
TargetSodium channel protein type 10 subunit alpha
LigandBDBM50270706
Substrate/Competitorn/a
Meas. Tech.ChEMBL_552551 (CHEMBL953995)
IC50 1600±n/a nM
Citation Drizin, IGregg, RJScanio, MJShi, LGross, MFAtkinson, RNThomas, JBJohnson, MSCarroll, WAMarron, BEChapman, MLLiu, DKrambis, MJShieh, CCZhang, XHernandez, GGauvin, DMMikusa, JPZhu, CZJoshi, SHonore, PMarsh, KCRoeloffs, RWerness, SKrafte, DSJarvis, MFFaltynek, CRKort, ME Discovery of potent furan piperazine sodium channel blockers for treatment of neuropathic pain. Bioorg Med Chem16:6379-86 (2008) 
 
Sodium channel protein type 10 subunit alpha
Name:Sodium channel protein type 10 subunit alpha
Type:PROTEIN
Mol. Mass.:220545.77
Organism:Mus musculus
Description:ChEMBL_675096
Residue:1958
BDBM50270706
NameBDBM50270706
Synonyms:5-(4-Chlorophenyl)furan-2-carboxylic acid (3-piperidin-1-yl-propyl)amide | CHEMBL453468
TypeSmall organic molecule
Emp. Form.C19H23ClN2O2
Mol. Mass.346.851
SMILESClc1ccc(cc1)-c1ccc(o1)C(=O)NCCCN1CCCCC1