Reaction Details
TargetSodium channel protein type 10 subunit alpha
LigandBDBM50270682
Substrate/Competitorn/a
Meas. Tech.ChEMBL_552551 (CHEMBL953995)
IC50 900±n/a nM
Citation Drizin, IGregg, RJScanio, MJShi, LGross, MFAtkinson, RNThomas, JBJohnson, MSCarroll, WAMarron, BEChapman, MLLiu, DKrambis, MJShieh, CCZhang, XHernandez, GGauvin, DMMikusa, JPZhu, CZJoshi, SHonore, PMarsh, KCRoeloffs, RWerness, SKrafte, DSJarvis, MFFaltynek, CRKort, ME Discovery of potent furan piperazine sodium channel blockers for treatment of neuropathic pain. Bioorg Med Chem16:6379-86 (2008) 
 
Sodium channel protein type 10 subunit alpha
Name:Sodium channel protein type 10 subunit alpha
Type:PROTEIN
Mol. Mass.:220545.77
Organism:Mus musculus
Description:ChEMBL_675096
Residue:1958
BDBM50270682
NameBDBM50270682
Synonyms:5-(4-Chlorophenyl)furan-2-carboxylic acid-(2-piperidin-1-yl-ethyl)amide | CHEMBL519073
TypeSmall organic molecule
Emp. Form.C18H21ClN2O2
Mol. Mass.332.825
SMILESClc1ccc(cc1)-c1ccc(o1)C(=O)NCCN1CCCCC1