Reaction Details
TargetSodium channel protein type 5 subunit alpha
LigandBDBM50270679
Substrate/Competitorn/a
Meas. Tech.ChEMBL_552565 (CHEMBL954009)
IC50 2300±n/a nM
Citation Drizin, IGregg, RJScanio, MJShi, LGross, MFAtkinson, RNThomas, JBJohnson, MSCarroll, WAMarron, BEChapman, MLLiu, DKrambis, MJShieh, CCZhang, XHernandez, GGauvin, DMMikusa, JPZhu, CZJoshi, SHonore, PMarsh, KCRoeloffs, RWerness, SKrafte, DSJarvis, MFFaltynek, CRKort, ME Discovery of potent furan piperazine sodium channel blockers for treatment of neuropathic pain. Bioorg Med Chem16:6379-86 (2008) 
 
Sodium channel protein type 5 subunit alpha
Name:Sodium channel protein type 5 subunit alpha
Type:Enzyme
Mol. Mass.:226908.60
Organism:Homo sapiens (Human)
Description:Q14524
Residue:2016
BDBM50270679
NameBDBM50270679
Synonyms:CHEMBL482676 | [5-(4-Chlorophenyl)furan-2-yl]-(4-cyclohexylpiperazin-1-yl)-methanone
TypeSmall organic molecule
Emp. Form.C21H25ClN2O2
Mol. Mass.372.888
SMILESClc1ccc(cc1)-c1ccc(o1)C(=O)N1CCN(CC1)C1CCCCC1