Reaction Details
TargetUrotensin-2 receptor
LigandBDBM50243920
Substrate/Competitorn/a
Meas. Tech.ChEMBL_555221 (CHEMBL965358)
Ki 2500±n/a nM
Citation McAtee, JJDodson, JWDowdell, SEErhard, KGirard, GRGoodman, KBHilfiker, MAJin, JSehon, CASha, DShi, DWang, FWang, GZWang, NWang, YViet, AQYuan, CCZhang, DAiyar, NVBehm, DJCarballo, LHEvans, CAFries, HENagilla, RRoethke, TJXu, XDouglas, SANeeb, MJ Potent and selective small-molecule human urotensin-II antagonists with improved pharmacokinetic profiles. Bioorg Med Chem Lett18:3716-9 (2008) 
 
Urotensin-2 receptor
Name:Urotensin-2 receptor
Type:Enzyme Catalytic Domain
Mol. Mass.:42159.71
Organism:Homo sapiens (Human)
Description:Urotensin-II UTS2R HUMAN::Q9UKP6
Residue:389
BDBM50243920
NameBDBM50243920
Synonyms:(S)-2-((3,4-dichlorophenyl)(methyl)amino)-N-methyl-N-(1-phenyl-2-(pyrrolidin-1-yl)ethyl)acetamide | CHEMBL488635
TypeSmall organic molecule
Emp. Form.C22H27Cl2N3O
Mol. Mass.420.375
SMILESCN(CC(=O)N(C)[C@H](CN1CCCC1)c1ccccc1)c1ccc(Cl)c(Cl)c1