Reaction Details
TargetUrotensin-2 receptor
LigandBDBM50243969
Substrate/Competitorn/a
Meas. Tech.ChEMBL_555221 (CHEMBL965358)
Ki 630±n/a nM
Citation McAtee, JJDodson, JWDowdell, SEErhard, KGirard, GRGoodman, KBHilfiker, MAJin, JSehon, CASha, DShi, DWang, FWang, GZWang, NWang, YViet, AQYuan, CCZhang, DAiyar, NVBehm, DJCarballo, LHEvans, CAFries, HENagilla, RRoethke, TJXu, XDouglas, SANeeb, MJ Potent and selective small-molecule human urotensin-II antagonists with improved pharmacokinetic profiles. Bioorg Med Chem Lett18:3716-9 (2008) 
 
Urotensin-2 receptor
Name:Urotensin-2 receptor
Type:Enzyme Catalytic Domain
Mol. Mass.:42159.71
Organism:Homo sapiens (Human)
Description:Urotensin-II UTS2R HUMAN::Q9UKP6
Residue:389
BDBM50243969
NameBDBM50243969
Synonyms:CHEMBL452298 | N-(1-Biphenyl-4-yl-2-morpholin-4-yl-ethyl)-2-[(3,4-dichloro-phenyl)-methyl-amino]-N-methyl-acetamide
TypeSmall organic molecule
Emp. Form.C28H31Cl2N3O2
Mol. Mass.512.471
SMILESCN(CC(=O)N(C)C(CN1CCOCC1)c1ccc(cc1)-c1ccccc1)c1ccc(Cl)c(Cl)c1