Reaction Details
TargetCytochrome P450 2D6
LigandBDBM50244065
Substrate/Competitorn/a
Meas. Tech.ChEMBL_555224 (CHEMBL965361)
IC50 17000±n/a nM
Citation McAtee, JJDodson, JWDowdell, SEErhard, KGirard, GRGoodman, KBHilfiker, MAJin, JSehon, CASha, DShi, DWang, FWang, GZWang, NWang, YViet, AQYuan, CCZhang, DAiyar, NVBehm, DJCarballo, LHEvans, CAFries, HENagilla, RRoethke, TJXu, XDouglas, SANeeb, MJ Potent and selective small-molecule human urotensin-II antagonists with improved pharmacokinetic profiles. Bioorg Med Chem Lett18:3716-9 (2008) 
 
Cytochrome P450 2D6
Name:Cytochrome P450 2D6
Type:Protein
Mol. Mass.:55774.82
Organism:Homo sapiens (Human)
Description:P10635
Residue:497
BDBM50244065
NameBDBM50244065
Synonyms:2-(6,7-Dichloro-3-oxo-2,3-dihydro-benzo[1,4]oxazin-4-yl)-N-[1-(3'-methoxy-biphenyl-4-yl)-2-morpholin-4-yl-ethyl]-N-methyl-acetamide | CHEMBL453329
TypeSmall organic molecule
Emp. Form.C30H31Cl2N3O5
Mol. Mass.584.49
SMILESCOc1cccc(c1)-c1ccc(cc1)C(CN1CCOCC1)N(C)C(=O)CN1C(=O)COc2cc(Cl)c(Cl)cc12