Reaction Details
TargetKappa-type opioid receptor
LigandBDBM50244019
Substrate/Competitorn/a
Meas. Tech.ChEMBL_555222 (CHEMBL965359)
EC50 100±n/a nM
Citation McAtee, JJDodson, JWDowdell, SEErhard, KGirard, GRGoodman, KBHilfiker, MAJin, JSehon, CASha, DShi, DWang, FWang, GZWang, NWang, YViet, AQYuan, CCZhang, DAiyar, NVBehm, DJCarballo, LHEvans, CAFries, HENagilla, RRoethke, TJXu, XDouglas, SANeeb, MJ Potent and selective small-molecule human urotensin-II antagonists with improved pharmacokinetic profiles. Bioorg Med Chem Lett18:3716-9 (2008) 
 
Kappa-type opioid receptor
Name:Kappa-type opioid receptor
Type:G Protein-Coupled Receptor (GPCR)
Mol. Mass.:42648.76
Organism:Homo sapiens (Human)
Description:P41145
Residue:380
BDBM50244019
NameBDBM50244019
Synonyms:4'-[1-({2-[(3,4-Dichloro-phenyl)-(2-methoxy-ethyl)-amino]-acetyl}-methyl-amino)-2-pyrrolidin-1-yl-ethyl]-biphenyl-4-carboxylic acid amide | CHEMBL453067
TypeSmall organic molecule
Emp. Form.C31H36Cl2N4O3
Mol. Mass.583.549
SMILESCOCCN(CC(=O)N(C)C(CN1CCCC1)c1ccc(cc1)-c1ccc(cc1)C(N)=O)c1ccc(Cl)c(Cl)c1