Reaction Details
TargetAurora kinase A
LigandBDBM50244031
Substrate/Competitorn/a
Meas. Tech.ChEMBL_554991 (CHEMBL962087)
IC50 16000±n/a nM
Citation Peifer, CSelig, RKinkel, KOtt, DTotzke, FSchächtele, CHeidenreich, RRöcken, MSchollmeyer, DLaufer, S Design, synthesis, and biological evaluation of novel 3-aryl-4-(1H-indole-3yl)-1,5-dihydro-2H-pyrrole-2-ones as vascular endothelial growth factor receptor (VEGF-R) inhibitors. J Med Chem51:3814-24 (2008) 
 
Aurora kinase A
Name:Aurora kinase A
Type:Serine/threonine-protein kinase
Mol. Mass.:45830.98
Organism:Homo sapiens (Human)
Description:O14965
Residue:403
BDBM50244031
NameBDBM50244031
Synonyms:3-(1H-Indol-3-yl)-4-(4-methoxyphenyl)-1,5-dihydro-2H-pyrrole-2-one | CHEMBL452812
TypeSmall organic molecule
Emp. Form.C19H16N2O2
Mol. Mass.304.3425
SMILESCOc1ccc(cc1)C1=C(C(=O)NC1)c1c[nH]c2ccccc12