Reaction Details
TargetEpidermal growth factor receptor
LigandBDBM50243977
Substrate/Competitorn/a
Meas. Tech.ChEMBL_554997 (CHEMBL957972)
IC50 14000±n/a nM
Citation Peifer, CSelig, RKinkel, KOtt, DTotzke, FSchächtele, CHeidenreich, RRöcken, MSchollmeyer, DLaufer, S Design, synthesis, and biological evaluation of novel 3-aryl-4-(1H-indole-3yl)-1,5-dihydro-2H-pyrrole-2-ones as vascular endothelial growth factor receptor (VEGF-R) inhibitors. J Med Chem51:3814-24 (2008) 
 
Epidermal growth factor receptor
Name:Epidermal growth factor receptor
Type:Receptor Kinase Domain
Mol. Mass.:134279.59
Organism:Homo sapiens (Human)
Description:P00533
Residue:1210
BDBM50243977
NameBDBM50243977
Synonyms:4-{1-[(Benzyloxy)methyl]-1H-indol-3-yl}-3-(3,4,5-trimethoxyphenyl)-1,5-dihydro-2H-pyrrole-2-one | CHEMBL453336
TypeSmall organic molecule
Emp. Form.C29H28N2O5
Mol. Mass.484.543
SMILESCOc1cc(cc(OC)c1OC)C1=C(CNC1=O)c1cn(COCc2ccccc2)c2ccccc12